Target
Tartrate-resistant acid phosphatase type 5
Ligand
BDBM50469088
Substrate
Meas. Tech.
ChEMBL_1802620 (CHEMBL4274912)
Ki
120000±n/a nM
Citation
 Hussein, WMFeder, DSchenk, GGuddat, LWMcGeary, RP Purple acid phosphatase inhibitors as leads for osteoporosis chemotherapeutics. Eur J Med Chem 157:462-479 (2018)  
Target
Name:
Tartrate-resistant acid phosphatase type 5
Synonyms:
3.1.3.2 PPA5_PIG Tartrate-resistant acid ATPase TrATPase Uteroferrin
Type:
PROTEIN
Mol. Mass.:
38029.68
Organism:
Sus scrofa
Description:
ChEMBL_117953
Residue:
340
  
Inhibitor
Name:
BDBM50469088
Synonyms:
CHEMBL4287988
Type:
Small organic molecule
Emp. Form.:
C11H9NO3S
Mol. Mass.:
235.259
SMILES:
COc1ccc(cc1)-c1nc(cs1)C(O)=O
: