Target
DNA topoisomerase 4 subunit B
Ligand
BDBM50470393
Substrate
Meas. Tech.
ChEMBL_1802726 (CHEMBL4275018)
IC50
12±n/a nM
Citation
 Ho, SYWang, WNg, FMWong, YXPoh, ZYTan, SWEAng, SHLiew, SSJoyner Wong, YSTan, YPoulsen, APendharkar, VSangthongpitag, KManchester, JBasarab, GHill, JKeller, THCherian, J Discovery of dual GyrB/ParE inhibitors active against Gram-negative bacteria. Eur J Med Chem 157:610-621 (2018)  
Target
Name:
DNA topoisomerase 4 subunit B
Synonyms:
DNA Topoisomerase IV Subunit B PARE_ECOLI parE
Type:
Enzyme Subunit
Mol. Mass.:
70233.03
Organism:
Escherichia coli (strain K12)
Description:
Residue:
630
  
Inhibitor
Name:
BDBM50470393
Synonyms:
CHEMBL4291061
Type:
Small organic molecule
Emp. Form.:
C26H26F3N9O3S
Mol. Mass.:
601.603
SMILES:
[H][C@]12CC[C@]([H])(C[C@H](N)C1)N2c1ncc(cc1-c1cnc(NC(=O)NCC)cc1-c1nc(cs1)C(F)(F)F)-c1n[nH]c(=O)o1
: