Target
Probable global transcription activator SNF2L2
Ligand
BDBM50469322
Substrate
Meas. Tech.
ChEMBL_1803941 (CHEMBL4276233)
IC50
200±n/a nM
Citation
 Papillon, JPNNakajima, KAdair, CDHempel, JJouk, AOKarki, RGMathieu, SMöbitz, HNtaganda, RSmith, TVisser, MHill, SEHurtado, FKChenail, GBhang, HCBric, AXiang, KBushold, GGilbert, TVattay, ADooley, JCosta, EAPark, ILi, AFarley, DLounkine, EYue, QKXie, XZhu, XKulathila, RKing, DHu, TVulic, KCantwell, JLuu, CJagani, Z Discovery of Orally Active Inhibitors of Brahma Homolog (BRM)/SMARCA2 ATPase Activity for the Treatment of Brahma Related Gene 1 (BRG1)/SMARCA4-Mutant Cancers. J Med Chem 61:10155-10172 (2018)  
Target
Name:
Probable global transcription activator SNF2L2
Synonyms:
ATP-dependent helicase SMARCA2 BRG1-associated factor 190B Protein brahma homolog SMCA2_HUMAN SNF2A SWI/SNF-related matrix-associated actin-dependent regulator of chromatin subfamily A member 2 | hBRM
Type:
Enzyme Catalytic Domain
Mol. Mass.:
181290.91
Organism:
Homo sapiens (Human)
Description:
P51531
Residue:
1590
  
Inhibitor
Name:
BDBM50469322
Synonyms:
CHEMBL4281368
Type:
Small organic molecule
Emp. Form.:
C12H11ClN4O
Mol. Mass.:
262.695
SMILES:
Cc1cc(NC(=O)Nc2ccnc(Cl)c2)ccn1
: