Target
NUAK family SNF1-like kinase 1
Ligand
BDBM50055496
Substrate
Meas. Tech.
ChEMBL_1804069 (CHEMBL4276361)
IC50
8.0±n/a nM
Citation
 Zhao, JZhang, DZhang, WStashko, MADeRyckere, DVasileiadi, EParker, REHunter, DLiu, QZhang, YNorris-Drouin, JLi, BDrewry, DHKireev, DGraham, DKEarp, HSFrye, SVWang, X Highly Selective MERTK Inhibitors Achieved by a Single Methyl Group. J Med Chem 61:10242-10254 (2018)  
Target
Name:
NUAK family SNF1-like kinase 1
Synonyms:
ARK5 NUAK1 OMPHK1
Type:
PROTEIN
Mol. Mass.:
74326.51
Organism:
Homo sapiens (Human)
Description:
ChEMBL_1451343
Residue:
661
  
Inhibitor
Name:
BDBM50055496
Synonyms:
CHEMBL3326006
Type:
Small organic molecule
Emp. Form.:
C28H40N6O
Mol. Mass.:
476.6568
SMILES:
CCCCNc1ncc2c(cn([C@H]3CC[C@H](O)CC3)c2n1)-c1ccc(CN2CCN(C)CC2)cc1
: