Target
mRNA cap guanine-N7 methyltransferase
Ligand
BDBM50470544
Substrate
Meas. Tech.
ChEMBL_1803088 (CHEMBL4275380)
IC50
10150±n/a nM
Citation
 Niroula, DHallada, LPLe Chapelain, CGanegamage, SKDotson, DRogelj, SGroll, MTello-Aburto, R Design, synthesis, and evaluation of cystargolide-based ?-lactones as potent proteasome inhibitors. Eur J Med Chem 157:962-977 (2018)  
Target
Name:
mRNA cap guanine-N7 methyltransferase
Synonyms:
2.1.1.56 MCES_HUMAN RNMT hMet mRNA (guanine-N(7)-)-methyltransferase mRNA cap methyltransferase
Type:
PROTEIN
Mol. Mass.:
54843.48
Organism:
Homo sapiens
Description:
ChEMBL_117907
Residue:
476
  
Inhibitor
Name:
BDBM50470544
Synonyms:
CHEMBL4282765
Type:
Small organic molecule
Emp. Form.:
C17H28N2O6
Mol. Mass.:
356.414
SMILES:
CC(C)[C@H](NC(=O)[C@@H](NC(=O)[C@@H]1OC(=O)[C@H]1C(C)C)C(C)C)C(O)=O
: