Target
mRNA cap guanine-N7 methyltransferase
Ligand
BDBM50470559
Substrate
Meas. Tech.
ChEMBL_1803089 (CHEMBL4275381)
IC50
>10000±n/a nM
Citation
 Niroula, DHallada, LPLe Chapelain, CGanegamage, SKDotson, DRogelj, SGroll, MTello-Aburto, R Design, synthesis, and evaluation of cystargolide-based ?-lactones as potent proteasome inhibitors. Eur J Med Chem 157:962-977 (2018)  
Target
Name:
mRNA cap guanine-N7 methyltransferase
Synonyms:
2.1.1.56 MCES_HUMAN RNMT hMet mRNA (guanine-N(7)-)-methyltransferase mRNA cap methyltransferase
Type:
PROTEIN
Mol. Mass.:
54843.48
Organism:
Homo sapiens
Description:
ChEMBL_117907
Residue:
476
  
Inhibitor
Name:
BDBM50470559
Synonyms:
CHEMBL4285979
Type:
Small organic molecule
Emp. Form.:
C21H34N2O6
Mol. Mass.:
410.5045
SMILES:
[H][C@]1([C@@H](C)CC)[C@@H](OC1=O)C(=O)N[C@@H](C(C)C)C(=O)N[C@@H](C(C)C)C(=O)OCC=C
: