Target
mRNA cap guanine-N7 methyltransferase
Ligand
BDBM50277889
Substrate
Meas. Tech.
ChEMBL_1803088 (CHEMBL4275380)
IC50
>1000±n/a nM
Citation
 Niroula, DHallada, LPLe Chapelain, CGanegamage, SKDotson, DRogelj, SGroll, MTello-Aburto, R Design, synthesis, and evaluation of cystargolide-based ?-lactones as potent proteasome inhibitors. Eur J Med Chem 157:962-977 (2018)  
Target
Name:
mRNA cap guanine-N7 methyltransferase
Synonyms:
2.1.1.56 MCES_HUMAN RNMT hMet mRNA (guanine-N(7)-)-methyltransferase mRNA cap methyltransferase
Type:
PROTEIN
Mol. Mass.:
54843.48
Organism:
Homo sapiens
Description:
ChEMBL_117907
Residue:
476
  
Inhibitor
Name:
BDBM50277889
Synonyms:
CARFILZOMIB | CHEMBL451887
Type:
Small organic molecule
Emp. Form.:
C40H57N5O7
Mol. Mass.:
719.9099
SMILES:
CC(C)C[C@H](NC(=O)[C@H](CCc1ccccc1)NC(=O)CN1CCOCC1)C(=O)N[C@@H](Cc1ccccc1)C(=O)N[C@@H](CC(C)C)C(=O)[C@@]1(C)CO1
: