Target
Melatonin receptor type 1A/1B
Ligand
BDBM50034110
Substrate
Meas. Tech.
ChEMBL_104782 (CHEMBL714925)
Ki
0.017000±n/a nM
Citation
 Tarzia, GDiamantini, GDi Giacomo, BSpadoni, GEsposti, DNonno, RLucini, VPannacci, MFraschini, FStankov, BM 1-(2-Alkanamidoethyl)-6-methoxyindole derivatives: a new class of potent indole melatonin analogues. J Med Chem 40:2003-10 (1997)  
Target
Name:
Melatonin receptor type 1A/1B
Synonyms:
Melatonin receptor
Type:
Mol. Mass.:
Description:
ASSAY_ID of ChEMBL is 104946
Components:
This complex has 2 components.
Component 1
Name:
Melatonin receptor type 1A
Synonyms:
MTNR1A MTR1A_HUMAN Mel1a melatonin receptor Melatonin receptor Melatonin receptor type 1 (MT1) | Melatonin receptor type 1A
Type:
Enzyme
Mol. Mass.:
39392.94
Organism:
Homo sapiens (Human)
Description:
P48039
Residue:
350
  
Component 2
Name:
Melatonin receptor type 1B
Synonyms:
MTNR1B Mel-1B-R Melatonin 1B Melatonin receptor type 1B | Melatonin receptor type 2 (MT2)
Type:
Enzyme
Mol. Mass.:
40203.54
Organism:
Homo sapiens (Human)
Description:
P49286
Residue:
362
  
Inhibitor
Name:
BDBM50034110
Synonyms:
CHEMBL15060 N-[2-(5-Methoxy-2-phenyl-1H-indol-3-yl)-ethyl]-acetamide
Type:
Small organic molecule
Emp. Form.:
C19H20N2O2
Mol. Mass.:
308.3743
SMILES:
COc1ccc2[nH]c(c(CCNC(C)=O)c2c1)-c1ccccc1
: