Target
Alpha-1A/Alpha-1B/Alpha-1D adrenergic receptor
Ligand
BDBM50036913
Substrate
Meas. Tech.
ChEMBL_34423 (CHEMBL649427)
Ki
1110±n/a nM
Citation
 Zhang, XDe Los Angeles, JEHe, MYDalton, JTShams, GLei, LPatil, PNFeller, DRMiller, DDHsu, FL Medetomidine analogs as alpha 2-adrenergic ligands. 3. Synthesis and biological evaluation of a new series of medetomidine analogs and their potential binding interactions with alpha 2-adrenoceptors involving a "methyl pocket". J Med Chem 40:3014-24 (1997)  
Target
Name:
Alpha-1A/Alpha-1B/Alpha-1D adrenergic receptor
Synonyms:
Adrenergic receptor alpha-1 alpha-1 Adrenergic Receptor
Type:
Mol. Mass.:
Description:
ASSAY_ID of EBI is 303470
Components:
This complex has 3 components.
Component 1
Name:
Alpha-1B adrenergic receptor
Synonyms:
ADA1B_RAT Alpha 1B-adrenoceptor Alpha adrenergic receptor 1A and 1B Alpha-1Adrenoceptor Alpha-1B adrenoreceptor | adrenergic Alpha1B
Type:
G Protein-Coupled Receptor (GPCR)
Mol. Mass.:
56606.71
Organism:
Rattus norvegicus (rat)
Description:
Receptor binding assays were performed using rat cortical membranes.
Residue:
515
  
Component 2
Name:
Alpha-1A adrenergic receptor
Synonyms:
ADA1A_RAT Adra1c Alpha-1A adrenoceptor Alpha-1C adrenergic receptor | adrenergic Alpha1A
Type:
Protein
Mol. Mass.:
51620.15
Organism:
Rattus norvegicus (Rat)
Description:
P43140
Residue:
466
  
Component 3
Name:
Alpha-1D adrenergic receptor
Synonyms:
ADA1D_RAT Adra1d Alpha-1D adrenergic receptor | Serotonin 1a (5-HT1a) receptor/Adrenergic receptor alpha-1
Type:
Protein
Mol. Mass.:
59375.97
Organism:
Rattus norvegicus (Rat)
Description:
P23944
Residue:
561
  
Inhibitor
Name:
BDBM50036913
Synonyms:
(+-)-4-(alpha,2,3-trimethylbenzyl)imidazole CHEMBL77921 | medetomidine
Type:
Small organic molecule
Emp. Form.:
C13H16N2
Mol. Mass.:
200.2795
SMILES:
CC(c1cnc[nH]1)c1cccc(C)c1C
: