Target
Nischarin
Ligand
BDBM50138500
Substrate
Meas. Tech.
ChEMBL_88905 (CHEMBL698300)
Ki
2.0±n/a nM
Citation
 Baurin, NVangrevelinghe, EMorin-Allory, LMérour, JYRenard, PPayard, MGuillaumet, GMarot, C 3D-QSAR CoMFA study on imidazolinergic I(2) ligands: a significant model through a combined exploration of structural diversity and methodology. J Med Chem 43:1109-22 (2000)  
Target
Name:
Nischarin
Synonyms:
IRAS Imidazoline receptor 1 (I1R) NISCH Nischarin
Type:
Enzyme
Mol. Mass.:
166571.31
Organism:
Homo sapiens (Human)
Description:
Q9Y2I1
Residue:
1504
  
Inhibitor
Name:
BDBM50138500
Synonyms:
2-((E)-Styryl)-4,5-dihydro-1H-imidazole CHEMBL275970
Type:
Small organic molecule
Emp. Form.:
C11H12N2
Mol. Mass.:
172.2264
SMILES:
C1CN=C(N1)\C=C\c1ccccc1
: