Target
Nischarin
Ligand
BDBM50027060
Substrate
Meas. Tech.
ChEMBL_88905 (CHEMBL698300)
Ki
4.0±n/a nM
Citation
 Baurin, NVangrevelinghe, EMorin-Allory, LMérour, JYRenard, PPayard, MGuillaumet, GMarot, C 3D-QSAR CoMFA study on imidazolinergic I(2) ligands: a significant model through a combined exploration of structural diversity and methodology. J Med Chem 43:1109-22 (2000)  
Target
Name:
Nischarin
Synonyms:
IRAS Imidazoline receptor 1 (I1R) NISCH Nischarin
Type:
Enzyme
Mol. Mass.:
166571.31
Organism:
Homo sapiens (Human)
Description:
Q9Y2I1
Residue:
1504
  
Inhibitor
Name:
BDBM50027060
Synonyms:
2-(2-Cyclopropyl-phenoxymethyl)-4,5-dihydro-1H-imidazole CHEMBL13852 | CIRAZOLINE
Type:
Small organic molecule
Emp. Form.:
C13H16N2O
Mol. Mass.:
216.2789
SMILES:
C(Oc1ccccc1C1CC1)C1=NCCN1
: