Target
Nischarin
Ligand
BDBM50473175
Substrate
Meas. Tech.
ChEMBL_88905 (CHEMBL698300)
Ki
3.2±n/a nM
Citation
 Baurin, NVangrevelinghe, EMorin-Allory, LMérour, JYRenard, PPayard, MGuillaumet, GMarot, C 3D-QSAR CoMFA study on imidazolinergic I(2) ligands: a significant model through a combined exploration of structural diversity and methodology. J Med Chem 43:1109-22 (2000)  
Target
Name:
Nischarin
Synonyms:
IRAS Imidazoline receptor 1 (I1R) NISCH Nischarin
Type:
Enzyme
Mol. Mass.:
166571.31
Organism:
Homo sapiens (Human)
Description:
Q9Y2I1
Residue:
1504
  
Inhibitor
Name:
BDBM50473175
Synonyms:
CHEMBL13631
Type:
Small organic molecule
Emp. Form.:
C12H11N3
Mol. Mass.:
197.2358
SMILES:
C1CN=C(N1)c1cnc2ccccc2c1
: