Target
Nischarin
Ligand
BDBM50127591
Substrate
Meas. Tech.
ChEMBL_88905 (CHEMBL698300)
Ki
2.0±n/a nM
Citation
 Baurin, NVangrevelinghe, EMorin-Allory, LMérour, JYRenard, PPayard, MGuillaumet, GMarot, C 3D-QSAR CoMFA study on imidazolinergic I(2) ligands: a significant model through a combined exploration of structural diversity and methodology. J Med Chem 43:1109-22 (2000)  
Target
Name:
Nischarin
Synonyms:
IRAS Imidazoline receptor 1 (I1R) NISCH Nischarin
Type:
Enzyme
Mol. Mass.:
166571.31
Organism:
Homo sapiens (Human)
Description:
Q9Y2I1
Residue:
1504
  
Inhibitor
Name:
BDBM50127591
Synonyms:
2-(4,5-Dihydro-1H-imidazol-2-yl)-4,6-dimethyl-3,4-dihydro-2H-benzo[1,4]oxazine | CHEMBL13987
Type:
Small organic molecule
Emp. Form.:
C13H17N3O
Mol. Mass.:
231.2936
SMILES:
CN1CC(Oc2ccc(C)cc12)C1=NCCN1
: