Target
Nischarin
Ligand
BDBM50138499
Substrate
Meas. Tech.
ChEMBL_88905 (CHEMBL698300)
Ki
2.5±n/a nM
Citation
 Baurin, NVangrevelinghe, EMorin-Allory, LMérour, JYRenard, PPayard, MGuillaumet, GMarot, C 3D-QSAR CoMFA study on imidazolinergic I(2) ligands: a significant model through a combined exploration of structural diversity and methodology. J Med Chem 43:1109-22 (2000)  
Target
Name:
Nischarin
Synonyms:
IRAS Imidazoline receptor 1 (I1R) NISCH Nischarin
Type:
Enzyme
Mol. Mass.:
166571.31
Organism:
Homo sapiens (Human)
Description:
Q9Y2I1
Residue:
1504
  
Inhibitor
Name:
BDBM50138499
Synonyms:
2-Phenethyl-4,5-dihydro-1H-imidazole | CHEMBL14210
Type:
Small organic molecule
Emp. Form.:
C11H14N2
Mol. Mass.:
174.2423
SMILES:
C(Cc1ccccc1)C1=NCCN1
: