Target
Alpha-1B adrenergic receptor
Ligand
BDBM50473683
Substrate
Meas. Tech.
ChEMBL_34476 (CHEMBL651231)
EC50
6.0±n/a nM
Citation
 Hodson, SJBishop, MJSpeake, JDNavas, FGarrison, DTBigham, ECSaussy, DLLiacos, JAIrving, PEGobel, MJSherman, BW 2-(Anilinomethyl)imidazolines as alpha1 adrenergic receptor agonists: the discovery of alpha1a subtype selective 2'-alkylsulfonyl-substituted analogues. J Med Chem 45:2229-39 (2002)  
Target
Name:
Alpha-1B adrenergic receptor
Synonyms:
ADA1B_HUMAN Adrenergic alpha1B Adrenergic receptor alpha Alpha 1B-adrenoreceptor | Alpha-1B adrenergic receptor
Type:
Enzyme
Mol. Mass.:
56862.13
Organism:
Homo sapiens (Human)
Description:
P35368
Residue:
520
  
Inhibitor
Name:
BDBM50473683
Synonyms:
CHEMBL72724
Type:
Small organic molecule
Emp. Form.:
C12H14F3N3S
Mol. Mass.:
289.32
SMILES:
CSc1ccc(cc1NCC1=NCCN1)C(F)(F)F
: