Target
Alpha-1B adrenergic receptor
Ligand
BDBM50473674
Substrate
Meas. Tech.
ChEMBL_34476 (CHEMBL651231)
EC50
62±n/a nM
Citation
 Hodson, SJBishop, MJSpeake, JDNavas, FGarrison, DTBigham, ECSaussy, DLLiacos, JAIrving, PEGobel, MJSherman, BW 2-(Anilinomethyl)imidazolines as alpha1 adrenergic receptor agonists: the discovery of alpha1a subtype selective 2'-alkylsulfonyl-substituted analogues. J Med Chem 45:2229-39 (2002)  
Target
Name:
Alpha-1B adrenergic receptor
Synonyms:
ADA1B_HUMAN Adrenergic alpha1B Adrenergic receptor alpha Alpha 1B-adrenoreceptor | Alpha-1B adrenergic receptor
Type:
Enzyme
Mol. Mass.:
56862.13
Organism:
Homo sapiens (Human)
Description:
P35368
Residue:
520
  
Inhibitor
Name:
BDBM50473674
Synonyms:
CHEMBL70634
Type:
Small organic molecule
Emp. Form.:
C11H14ClN3O2S
Mol. Mass.:
287.766
SMILES:
CS(=O)(=O)c1ccc(Cl)cc1NCC1=NCCN1
: