Target
Mitogen-activated protein kinase 11/12/13/14
Ligand
BDBM50130665
Substrate
Meas. Tech.
ChEMBL_150029 (CHEMBL757001)
IC50
160±n/a nM
Citation
 Laufer, SAWagner, GKKotschenreuther, DAAlbrecht, W Novel substituted pyridinyl imidazoles as potent anticytokine agents with low activity against hepatic cytochrome P450 enzymes. J Med Chem 46:3230-44 (2003)  
Target
Name:
Mitogen-activated protein kinase 11/12/13/14
Synonyms:
MAP kinase p38
Type:
Mol. Mass.:
Description:
ASSAY_ID of ChEMBL is 1935922
Components:
This complex has 4 components.
Component 1
Name:
Mitogen-activated protein kinase 13
Synonyms:
MAP kinase p38 delta MK13_HUMAN Mitogen-activated protein kinase 13 (MAPK13) Mitogen-activated protein kinase p38 delta SAPK4 p38 delta/gamma
Type:
Enzyme
Mol. Mass.:
42097.16
Organism:
Homo sapiens (Human)
Description:
O15264
Residue:
365
  
Component 2
Name:
Mitogen-activated protein kinase 11
Synonyms:
MAP kinase p38 MK11_HUMAN Mitogen-activated protein kinase p38 beta SAPK2 Stress-activated protein kinase 2 p38-2 p38b
Type:
Enzyme Catalytic Domain
Mol. Mass.:
41351.73
Organism:
Homo sapiens (Human)
Description:
gi_20128774
Residue:
364
  
Component 3
Name:
Mitogen-activated protein kinase 14
Synonyms:
CSAID-binding protein CSBP1 CSPB1 MAP kinase 14 MAP kinase p38 alpha MAPK14 MK14_HUMAN Mitogen-activated protein kinase p38 alpha Stress-activated protein kinase 2a | p38 MAP kinase alpha/beta
Type:
Serine/threonine-protein kinase
Mol. Mass.:
41286.76
Organism:
Homo sapiens (Human)
Description:
Q16539
Residue:
360
  
Component 4
Name:
Mitogen-activated protein kinase 12
Synonyms:
ERK6 MAPK12 Mitogen-activated protein kinase 12 (MAPK12 p38 gamma) Mitogen-activated protein kinase 12 Gamma SAPK3 | p38 delta/gamma
Type:
Protein
Mol. Mass.:
41938.69
Organism:
Homo sapiens (Human)
Description:
P53778
Residue:
367
  
Inhibitor
Name:
BDBM50130665
Synonyms:
(RS)-{4-[5-(4-fluorophenyl)-2-methylsulfanyl-3H-imidazol-4-yl]pyridin-2-yl}-(1-phenylethyl)amine] CHEMBL111364 {4-[5-(4-Fluoro-phenyl)-2-methylsulfanyl-3H-imidazol-4-yl]-pyridin-2-yl}-(1-phenyl-ethyl)-amine
Type:
Small organic molecule
Emp. Form.:
C23H21FN4S
Mol. Mass.:
404.503
SMILES:
CSc1nc(c([nH]1)-c1ccc(F)cc1)-c1ccnc(NC(C)c2ccccc2)c1
: