Target
Adenosine receptor A3
Ligand
BDBM50149361
Substrate
Meas. Tech.
ChEMBL_304034 (CHEMBL840212)
Ki
4650000±n/a nM
Citation
 Bhattacharya, PRoy, K QSAR of adenosine A3 receptor antagonist 1,2,4-triazolo[4,3-a]quinoxalin-1-one derivatives using chemometric tools. Bioorg Med Chem Lett 15:3737-43 (2005)  
Target
Name:
Adenosine receptor A3
Synonyms:
A3 adenosine receptor (hA3) ADORA3 | Adenosine A3 receptor (A3AR)
Type:
G Protein-Coupled Receptor (GPCR)
Mol. Mass.:
36197.32
Organism:
Homo sapiens (Human)
Description:
P0DMS8
Residue:
318
  
Inhibitor
Name:
BDBM50149361
Synonyms:
4,6-Diamino-2-(4-methoxy-phenyl)-2H-[1,2,4]triazolo[4,3-a]quinoxalin-1-one | CHEMBL116827
Type:
Small organic molecule
Emp. Form.:
C16H14N6O2
Mol. Mass.:
322.3214
SMILES:
COc1ccc(cc1)-n1nc2c(N)nc3c(N)cccc3n2c1=O
: