Target
Beta-2 adrenergic receptor
Ligand
BDBM50027185
Substrate
Meas. Tech.
ChEMBL_304080 (CHEMBL852184)
Ki
0.630957±n/a nM
Citation
 Atkinson, PJBromidge, SMDuxon, MSGaster, LMHadley, MSHammond, BJohnson, CNMiddlemiss, DNNorth, SEPrice, GWRami, HKRiley, GJScott, CMShaw, TEStarr, KRStemp, GThewlis, KMThomas, DRThompson, MVong, AKWatson, JM 3,4-Dihydro-2H-benzoxazinones are 5-HT(1A) receptor antagonists with potent 5-HT reuptake inhibitory activity. Bioorg Med Chem Lett 15:737-41 (2005)  
Target
Name:
Beta-2 adrenergic receptor
Synonyms:
ADRB2 ADRB2_HUMAN Beta-2 adrenoceptor | Beta-2 adrenoreceptor
Type:
Mol. Mass.:
46461.69
Organism:
Homo sapiens (Human)
Description:
P07550
Residue:
413
  
Inhibitor
Name:
BDBM50027185
Synonyms:
CHEMBL183921
Type:
Small organic molecule
Emp. Form.:
C22H25N3O5
Mol. Mass.:
411.451
SMILES:
CC(COc1ccc2OCC(=O)Nc2c1)NCC(O)COc1cccc2[nH]ccc12
: