Target
5-hydroxytryptamine receptor 6
Ligand
BDBM28583
Substrate
Meas. Tech.
ChEMBL_321083 (CHEMBL872163)
Ki
1.3±n/a nM
Citation
 Ahmed, MBriggs, MABromidge, SMBuck, TCampbell, LDeeks, NJGarner, AGordon, LHamprecht, DWHolland, VJohnson, CNMedhurst, ADMitchell, DJMoss, SFPowles, JSeal, JTStean, TOStemp, GThompson, MTrail, BUpton, NWinborn, KWitty, DR Bicyclic heteroarylpiperazines as selective brain penetrant 5-HT6 receptor antagonists. Bioorg Med Chem Lett 15:4867-71 (2005)  
Target
Name:
5-hydroxytryptamine receptor 6
Synonyms:
5-HT-6 5-hydroxytryptamine receptor 6 (5-HT-6) 5-hydroxytryptamine receptor 6 (5HT6) HTR6 Serotonin 6 (5-HT6) receptor | Serotonin Receptor 6
Type:
G Protein-Coupled Receptor (GPCR)
Mol. Mass.:
46968.43
Organism:
Homo sapiens (Human)
Description:
P50406
Residue:
440
  
Inhibitor
Name:
BDBM28583
Synonyms:
5-chloro-N-[4-methoxy-3-(piperazin-1-yl)phenyl]-3-methyl-1-benzothiophene-2-sulfonamide hydrochloride SB 271046 | SB-271046
Type:
Small organic molecule
Emp. Form.:
C20H22ClN3O3S2
Mol. Mass.:
451.99
SMILES:
COc1ccc(NS(=O)(=O)c2sc3ccc(Cl)cc3c2C)cc1N1CCNCC1
: