Target
5-hydroxytryptamine receptor 6
Ligand
BDBM50475480
Substrate
Meas. Tech.
ChEMBL_321083 (CHEMBL872163)
Ki
0.316228±n/a nM
Citation
 Ahmed, MBriggs, MABromidge, SMBuck, TCampbell, LDeeks, NJGarner, AGordon, LHamprecht, DWHolland, VJohnson, CNMedhurst, ADMitchell, DJMoss, SFPowles, JSeal, JTStean, TOStemp, GThompson, MTrail, BUpton, NWinborn, KWitty, DR Bicyclic heteroarylpiperazines as selective brain penetrant 5-HT6 receptor antagonists. Bioorg Med Chem Lett 15:4867-71 (2005)  
Target
Name:
5-hydroxytryptamine receptor 6
Synonyms:
5-HT-6 5-hydroxytryptamine receptor 6 (5-HT-6) 5-hydroxytryptamine receptor 6 (5HT6) HTR6 Serotonin 6 (5-HT6) receptor | Serotonin Receptor 6
Type:
G Protein-Coupled Receptor (GPCR)
Mol. Mass.:
46968.43
Organism:
Homo sapiens (Human)
Description:
P50406
Residue:
440
  
Inhibitor
Name:
BDBM50475480
Synonyms:
CHEMBL193629
Type:
Small organic molecule
Emp. Form.:
C18H17Cl2N3O2S
Mol. Mass.:
410.317
SMILES:
Clc1cccc(c1)S(=O)(=O)n1ccc2c(ccc(Cl)c12)N1CCNCC1
: