Target
5-hydroxytryptamine receptor 6
Ligand
BDBM50475481
Substrate
Meas. Tech.
ChEMBL_321083 (CHEMBL872163)
Ki
2.5±n/a nM
Citation
 Ahmed, MBriggs, MABromidge, SMBuck, TCampbell, LDeeks, NJGarner, AGordon, LHamprecht, DWHolland, VJohnson, CNMedhurst, ADMitchell, DJMoss, SFPowles, JSeal, JTStean, TOStemp, GThompson, MTrail, BUpton, NWinborn, KWitty, DR Bicyclic heteroarylpiperazines as selective brain penetrant 5-HT6 receptor antagonists. Bioorg Med Chem Lett 15:4867-71 (2005)  
Target
Name:
5-hydroxytryptamine receptor 6
Synonyms:
5-HT-6 5-hydroxytryptamine receptor 6 (5-HT-6) 5-hydroxytryptamine receptor 6 (5HT6) HTR6 Serotonin 6 (5-HT6) receptor | Serotonin Receptor 6
Type:
G Protein-Coupled Receptor (GPCR)
Mol. Mass.:
46968.43
Organism:
Homo sapiens (Human)
Description:
P50406
Residue:
440
  
Inhibitor
Name:
BDBM50475481
Synonyms:
CHEMBL197297
Type:
Small organic molecule
Emp. Form.:
C19H20ClN3O2S
Mol. Mass.:
389.899
SMILES:
Cn1cc(c2cccc(N3CCNCC3)c12)S(=O)(=O)c1cccc(Cl)c1
: