Target
UDP-N-acetylmuramoylalanine--D-glutamate ligase
Ligand
BDBM50475598
Substrate
Meas. Tech.
ChEMBL_328937 (CHEMBL859887)
IC50
>65300±n/a nM
Citation
 Antane, SCaufield, CEHu, WKeeney, DLabthavikul, PMorris, KNaughton, SMPetersen, PJRasmussen, BASingh, GYang, Y Pulvinones as bacterial cell wall biosynthesis inhibitors. Bioorg Med Chem Lett 16:176-80 (2006)  
Target
Name:
UDP-N-acetylmuramoylalanine--D-glutamate ligase
Synonyms:
D-glutamic acid-adding enzyme MurD (E. coli) UDP-N-acetylmuramoyl-L-alanyl-D-glutamate synthetase | murD
Type:
Ligase
Mol. Mass.:
46963.02
Organism:
Escherichia coli (strain K12)
Description:
Residue:
438
  
Inhibitor
Name:
BDBM50475598
Synonyms:
CHEMBL381658
Type:
Small organic molecule
Emp. Form.:
C22H13F3O3
Mol. Mass.:
382.332
SMILES:
OC1=C(C(=O)O\C1=C/c1cccc(c1)C(F)(F)F)c1cccc2ccccc12
: