Target
UDP-N-acetylmuramoylalanine--D-glutamate ligase
Ligand
BDBM50475599
Substrate
Meas. Tech.
ChEMBL_328940 (CHEMBL859890)
IC50
20500±n/a nM
Citation
 Antane, SCaufield, CEHu, WKeeney, DLabthavikul, PMorris, KNaughton, SMPetersen, PJRasmussen, BASingh, GYang, Y Pulvinones as bacterial cell wall biosynthesis inhibitors. Bioorg Med Chem Lett 16:176-80 (2006)  
Target
Name:
UDP-N-acetylmuramoylalanine--D-glutamate ligase
Synonyms:
MURD_STAAU murD
Type:
Protein
Mol. Mass.:
49837.61
Organism:
Staphylococcus aureus (Firmicutes)
Description:
S. aureus MurD
Residue:
449
  
Inhibitor
Name:
BDBM50475599
Synonyms:
CHEMBL200097
Type:
Small organic molecule
Emp. Form.:
C25H18Cl2O3
Mol. Mass.:
437.315
SMILES:
Cc1ccccc1-c1ccc(\C=C2/OC(O)=C(C2=O)c2cc(Cl)cc(Cl)c2)cc1C
: