Target
UDP-N-acetylmuramoylalanine--D-glutamate ligase
Ligand
BDBM50475587
Substrate
Meas. Tech.
ChEMBL_328940 (CHEMBL859890)
IC50
10400±n/a nM
Citation
 Antane, SCaufield, CEHu, WKeeney, DLabthavikul, PMorris, KNaughton, SMPetersen, PJRasmussen, BASingh, GYang, Y Pulvinones as bacterial cell wall biosynthesis inhibitors. Bioorg Med Chem Lett 16:176-80 (2006)  
Target
Name:
UDP-N-acetylmuramoylalanine--D-glutamate ligase
Synonyms:
MURD_STAAU murD
Type:
Protein
Mol. Mass.:
49837.61
Organism:
Staphylococcus aureus (Firmicutes)
Description:
S. aureus MurD
Residue:
449
  
Inhibitor
Name:
BDBM50475587
Synonyms:
CHEMBL426651
Type:
Small organic molecule
Emp. Form.:
C23H12Cl4O3
Mol. Mass.:
478.152
SMILES:
OC1=C(C(=O)O\C1=C/c1ccccc1-c1ccc(Cl)c(Cl)c1)c1ccc(Cl)c(Cl)c1
: