Target
Muscarinic acetylcholine receptor M4
Ligand
BDBM50003015
Substrate
Meas. Tech.
ChEMBL_432436 (CHEMBL917431)
EC50
25119±n/a nM
Citation
 Piergentili, AQuaglia, WGiannella, MDel Bello, FBruni, BBuccioni, MCarrieri, ACiattini, S Dioxane and oxathiane nuclei: suitable substructures for muscarinic agonists. Bioorg Med Chem 15:886-96 (2007)  
Target
Name:
Muscarinic acetylcholine receptor M4
Synonyms:
ACM4_HUMAN Cholinergic, muscarinic M4 Muscarinic acetylcholine receptor M2 and M4
Type:
Enzyme Catalytic Domain
Mol. Mass.:
53079.31
Organism:
Homo sapiens (Human)
Description:
Cholinergic, muscarinic M4 CHRM4 HUMAN M3::P08173
Residue:
479
  
Inhibitor
Name:
BDBM50003015
Synonyms:
CHEMBL227378
Type:
Small organic molecule
Emp. Form.:
C9H20INO2
Mol. Mass.:
301.1651
SMILES:
[I-].C[C@@H]1COC[C@H](C[N+](C)(C)C)O1
: