Target
Muscarinic acetylcholine receptor M5
Ligand
BDBM50003014
Substrate
Meas. Tech.
ChEMBL_432437 (CHEMBL917432)
EC50
7940±n/a nM
Citation
 Piergentili, AQuaglia, WGiannella, MDel Bello, FBruni, BBuccioni, MCarrieri, ACiattini, S Dioxane and oxathiane nuclei: suitable substructures for muscarinic agonists. Bioorg Med Chem 15:886-96 (2007)  
Target
Name:
Muscarinic acetylcholine receptor M5
Synonyms:
ACM5_HUMAN | CHRM5
Type:
PROTEIN
Mol. Mass.:
60102.35
Organism:
Homo sapiens (Human)
Description:
ChEMBL_1517990
Residue:
532
  
Inhibitor
Name:
BDBM50003014
Synonyms:
CHEMBL228144
Type:
Small organic molecule
Emp. Form.:
C9H20INO2
Mol. Mass.:
301.1651
SMILES:
[I-].CC1COCC(C[N+](C)(C)C)O1
: