Target
Muscarinic acetylcholine receptor M2
Ligand
BDBM46858
Substrate
Meas. Tech.
ChEMBL_470967 (CHEMBL923036)
Ki
2455±n/a nM
Citation
 Vistoli, GPedretti, ADei, SScapecchi, SMarconi, CRomanelli, MN Docking analyses on human muscarinic receptors: unveiling the subtypes peculiarities in agonists binding. Bioorg Med Chem 16:3049-58 (2008)  
Target
Name:
Muscarinic acetylcholine receptor M2
Synonyms:
ACM2_HUMAN Cholinergic, muscarinic M2 Muscarinic acetylcholine receptor M2 and M5 | RecName: Full=Muscarinic acetylcholine receptor M2
Type:
GPCR
Mol. Mass.:
51730.61
Organism:
Homo sapiens (Human)
Description:
P08172
Residue:
466
  
Inhibitor
Name:
BDBM46858
Synonyms:
1-methyl-3,6-dihydro-2H-pyridine-5-carboxylic acid methyl ester;hydrobromide ARECOLINE HYDROBROMIDE SMR000058258 cid_9301 | methyl 1-methyl-3,6-dihydro-2H-pyridine-5-carboxylate;hydrobromide
Type:
Small organic molecule
Emp. Form.:
C8H13NO2
Mol. Mass.:
155.1943
SMILES:
COC(=O)C1=CCCN(C)C1
: