Target
Reverse transcriptase
Ligand
BDBM50478849
Substrate
Meas. Tech.
ChEMBL_526428 (CHEMBL971856)
IC50
700000±n/a nM
Citation
 Wright, ADde Nys, RAngerhofer, CKPezzuto, JMGurrath, M Biological activities and 3D QSAR studies of a series of Delisea pulchra (cf. fimbriata) derived natural products. J Nat Prod 69:1180-7 (2006)  
Target
Name:
Reverse transcriptase
Synonyms:
Type:
Protein
Mol. Mass.:
29598.37
Organism:
Human immunodeficiency virus 1
Description:
Q9WKE8
Residue:
254
  
Inhibitor
Name:
BDBM50478849
Synonyms:
CHEMBL504653
Type:
Small organic molecule
Emp. Form.:
C9H10BrClO3
Mol. Mass.:
281.531
SMILES:
CCC[C@@H](O)C1=C(Br)\C(OC1=O)=C\Cl
: