Target
Integrase
Ligand
BDBM50214744
Substrate
Meas. Tech.
ChEMBL_519245 (CHEMBL946684)
IC50
>100000±n/a nM
Citation
 Xia, CNLi, HBLiu, FHu, WX Synthesis of trans-caffeate analogues and their bioactivities against HIV-1 integrase and cancer cell lines. Bioorg Med Chem Lett 18:6553-7 (2008)  
Target
Name:
Integrase
Synonyms:
pol
Type:
PROTEIN
Mol. Mass.:
32203.43
Organism:
Human immunodeficiency virus 1
Description:
ChEMBL_106649
Residue:
288
  
Inhibitor
Name:
BDBM50214744
Synonyms:
(2E)-3-(4-hydroxy-3-methoxyphenyl)prop-2-enoic acid CHEMBL32749 ferulic acid
Type:
Small organic molecule
Emp. Form.:
C10H10O4
Mol. Mass.:
194.184
SMILES:
COc1cc(\C=C\C(O)=O)ccc1O
: