Target
Poly [ADP-ribose] polymerase tankyrase-2
Ligand
BDBM50188594
Substrate
Meas. Tech.
ChEMBL_1805712 (CHEMBL4305071)
IC50
2.1±n/a nM
Citation
 Velagapudi, UKLangelier, MFDelgado-Martin, CDiolaiti, MEBakker, SAshworth, APatel, BAShao, XPascal, JMTalele, TT Design and Synthesis of Poly(ADP-ribose) Polymerase Inhibitors: Impact of Adenosine Pocket-Binding Motif Appendage to the 3-Oxo-2,3-dihydrobenzofuran-7-carboxamide on Potency and Selectivity. J Med Chem 62:5330-5357 (2019)  
Target
Name:
Poly [ADP-ribose] polymerase tankyrase-2
Synonyms:
(ARTD6 or PARP5b) Poly [ADP-ribose] polymerase tankyrase-2 TNKL TNKS2_HUMAN Tankyrase 2 Tankyrase-2 Tankyrase-2 (TNKS2)
Type:
Enzyme
Mol. Mass.:
126937.16
Organism:
Homo sapiens (Human)
Description:
Q9H2K2
Residue:
1166
  
Inhibitor
Name:
BDBM50188594
Synonyms:
CHEBI:62878 | CHEMBL1086580
Type:
Small organic molecule
Emp. Form.:
C14H11F3N2OS
Mol. Mass.:
312.31
SMILES:
Oc1nc(nc2CCSCc12)-c1ccc(cc1)C(F)(F)F
: