Target
Genome polyprotein
Ligand
BDBM50481402
Substrate
Meas. Tech.
ChEMBL_609662 (CHEMBL1067225)
IC50
12840±n/a nM
Citation
 Podvinec, MLim, SPSchmidt, TScarsi, MWen, DSonntag, LSSanschagrin, PShenkin, PSSchwede, T Novel inhibitors of dengue virus methyltransferase: discovery by in vitro-driven virtual screening on a desktop computer grid. J Med Chem 53:1483-95 (2010)  
Target
Name:
Genome polyprotein
Synonyms:
2.1.1.56 2.7.7.48 3.6.1.15 Capsid protein C Envelope protein E Flavivirin protease NS3 catalytic subunit Matrix protein NS2A NS4B Non-structural protein 2A Non-structural protein 3 Non-structural protein 4B POLG_DEN2P Peptide pr RNA-directed RNA polymerase NS5 Serine protease subunit NS2B | Small envelope protein M
Type:
PROTEIN
Mol. Mass.:
379287.38
Organism:
Dengue virus type 2
Description:
ChEMBL_109134
Residue:
3388
  
Inhibitor
Name:
BDBM50481402
Synonyms:
CHEMBL604091 | ZINC 00633950
Type:
Small organic molecule
Emp. Form.:
C27H20N2O5
Mol. Mass.:
452.4581
SMILES:
O\C(=C1\[C@H](N(Cc2cccnc2)C(=O)C1=O)c1cccc(Oc2ccccc2)c1)c1ccco1
: