Target
Genome polyprotein
Ligand
BDBM11979
Substrate
Meas. Tech.
ChEMBL_609661 (CHEMBL1067224)
IC50
9460±n/a nM
Citation
 Podvinec, MLim, SPSchmidt, TScarsi, MWen, DSonntag, LSSanschagrin, PShenkin, PSSchwede, T Novel inhibitors of dengue virus methyltransferase: discovery by in vitro-driven virtual screening on a desktop computer grid. J Med Chem 53:1483-95 (2010)  
Target
Name:
Genome polyprotein
Synonyms:
2.1.1.56 2.7.7.48 3.6.1.15 Capsid protein C Envelope protein E Flavivirin protease NS3 catalytic subunit Matrix protein NS2A NS4B Non-structural protein 2A Non-structural protein 3 Non-structural protein 4B POLG_DEN2P Peptide pr RNA-directed RNA polymerase NS5 Serine protease subunit NS2B | Small envelope protein M
Type:
PROTEIN
Mol. Mass.:
379287.38
Organism:
Dengue virus type 2
Description:
ChEMBL_109134
Residue:
3388
  
Inhibitor
Name:
BDBM11979
Synonyms:
5-[(3-carboxy-4-hydroxyphenyl)methyl]-2-hydroxybenzoic acid MgrA inhibitor, 1 | chemical diversity library compound 4
Type:
Small organic molecule
Emp. Form.:
C15H12O6
Mol. Mass.:
288.2522
SMILES:
OC(=O)c1cc(Cc2ccc(O)c(c2)C(O)=O)ccc1O
: