Target
Genome polyprotein
Ligand
BDBM50481417
Substrate
Meas. Tech.
ChEMBL_609655 (CHEMBL1067218)
IC50
7990±n/a nM
Citation
 Podvinec, MLim, SPSchmidt, TScarsi, MWen, DSonntag, LSSanschagrin, PShenkin, PSSchwede, T Novel inhibitors of dengue virus methyltransferase: discovery by in vitro-driven virtual screening on a desktop computer grid. J Med Chem 53:1483-95 (2010)  
Target
Name:
Genome polyprotein
Synonyms:
2.1.1.56 2.7.7.48 3.6.1.15 Capsid protein C Envelope protein E Flavivirin protease NS3 catalytic subunit Matrix protein NS2A NS4B Non-structural protein 2A Non-structural protein 3 Non-structural protein 4B POLG_DEN2P Peptide pr RNA-directed RNA polymerase NS5 Serine protease subunit NS2B | Small envelope protein M
Type:
PROTEIN
Mol. Mass.:
379287.38
Organism:
Dengue virus type 2
Description:
ChEMBL_109134
Residue:
3388
  
Inhibitor
Name:
BDBM50481417
Synonyms:
CHEMBL597975 | ZINC 01196449
Type:
Small organic molecule
Emp. Form.:
C21H16BrNO3S
Mol. Mass.:
442.326
SMILES:
OC(=O)c1cccc(NC(=O)c2ccc(CSc3ccc(Br)cc3)cc2)c1
: