Target
Genome polyprotein
Ligand
BDBM89191
Substrate
Meas. Tech.
ChEMBL_609656 (CHEMBL1067219)
IC50
4910±n/a nM
Citation
 Podvinec, MLim, SPSchmidt, TScarsi, MWen, DSonntag, LSSanschagrin, PShenkin, PSSchwede, T Novel inhibitors of dengue virus methyltransferase: discovery by in vitro-driven virtual screening on a desktop computer grid. J Med Chem 53:1483-95 (2010)  
Target
Name:
Genome polyprotein
Synonyms:
2.1.1.56 2.7.7.48 3.6.1.15 Capsid protein C Envelope protein E Flavivirin protease NS3 catalytic subunit Matrix protein NS2A NS4B Non-structural protein 2A Non-structural protein 3 Non-structural protein 4B POLG_DEN2P Peptide pr RNA-directed RNA polymerase NS5 Serine protease subunit NS2B | Small envelope protein M
Type:
PROTEIN
Mol. Mass.:
379287.38
Organism:
Dengue virus type 2
Description:
ChEMBL_109134
Residue:
3388
  
Inhibitor
Name:
BDBM89191
Synonyms:
2-[(E)-[[2-(2-furyl)quinoline-4-carbonyl]hydrazono]methyl]benzoic acid 2-[(E)-[[2-(furan-2-yl)quinoline-4-carbonyl]hydrazinylidene]methyl]benzoic acid MLS001002148 cid_6906548
Type:
Small organic molecule
Emp. Form.:
C22H15N3O4
Mol. Mass.:
385.3722
SMILES:
OC(=O)c1ccccc1\C=N\NC(=O)c1cc(nc2ccccc12)-c1ccco1
: