Target
Retinol-binding protein 4
Ligand
BDBM50501921
Substrate
Meas. Tech.
ChEMBL_1805921 (CHEMBL4305280)
IC50
2.7±n/a nM
Citation
 Cioffi, CLRacz, BVaradi, AFreeman, EEConlon, MPChen, PZhu, LKitchen, DBBarnes, KDMartin, WHPearson, PGJohnson, GBlaner, WSPetrukhin, K Design, Synthesis, and Preclinical Efficacy of Novel Nonretinoid Antagonists of Retinol-Binding Protein 4 in the Mouse Model of Hepatic Steatosis. J Med Chem 62:5470-5500 (2019)  
Target
Name:
Retinol-binding protein 4
Synonyms:
PRBP RBP RET4_HUMAN Retinol-binding protein 4 (RBP4) | spa binding assay for rbp4
Type:
Protein
Mol. Mass.:
23008.75
Organism:
Homo sapiens (Human)
Description:
P02753
Residue:
201
  
Inhibitor
Name:
BDBM50501921
Synonyms:
CHEMBL4462481
Type:
Small organic molecule
Emp. Form.:
C20H19F3N4O
Mol. Mass.:
388.3863
SMILES:
Cc1ccc2nc(cn2n1)C(=O)N1CCC(CC1)c1ccccc1C(F)(F)F
: