Target
Steroid C26-monooxygenase
Ligand
BDBM29342
Substrate
Meas. Tech.
ChEMBL_700242 (CHEMBL1647343)
Kd
1680±n/a nM
Citation
 Ouellet, HKells, PMOrtiz de Montellano, PRPodust, LM Reverse type I inhibitor of Mycobacterium tuberculosis CYP125A1. Bioorg Med Chem Lett 21:332-7 (2011)  
Target
Name:
Steroid C26-monooxygenase
Synonyms:
CP125_MYCTO Cytochrome P450 125 (CYP125) cyp125 | cyp125A1
Type:
Enzyme
Mol. Mass.:
48425.01
Organism:
Mycobacterium tuberculosis
Description:
P9WPP0
Residue:
433
  
Inhibitor
Name:
BDBM29342
Synonyms:
ChemDiv C155-0123, 9
Type:
Small organic molecule
Emp. Form.:
C24H28N4O2
Mol. Mass.:
404.5047
SMILES:
CC1CCC(CC1)C(=O)NC(Cc1c[nH]c2ccccc12)C(=O)Nc1ccncc1
: