Target
Peptidase
Ligand
BDBM50482776
Substrate
Meas. Tech.
ChEMBL_708723 (CHEMBL1667065)
IC50
233±n/a nM
Citation
 Llarrull, LIFisher, JFMobashery, S Molecular basis and phenotype of methicillin resistance in Staphylococcus aureus and insights into new beta-lactams that meet the challenge. Antimicrob Agents Chemother 53:4051-63 (2009)  
Target
Name:
Peptidase
Synonyms:
MecA Penicillin binding protein 2 prime Penicillin binding protein 2a (PBP2a) Penicillin-binding protein 2'
Type:
PROTEIN
Mol. Mass.:
76113.18
Organism:
Staphylococcus aureus
Description:
ChEMBL_677175
Residue:
668
  
Inhibitor
Name:
BDBM50482776
Synonyms:
CHEBI:70718 PPI-0903 | TAK-599
Type:
Small organic molecule
Emp. Form.:
C22H21N8O8PS4
Mol. Mass.:
684.685
SMILES:
[H][C@]12SCC(Sc3nc(cs3)-c3cc[n+](C)cc3)=C(N1C(=O)[C@H]2NC(=O)C(=N/OCC)\c1nsc(NP(O)(O)=O)n1)C([O-])=O
: