Target
NAD-dependent protein deacetylase sirtuin-2
Ligand
BDBM27507
Substrate
Meas. Tech.
ChEMBL_1806338 (CHEMBL4305697)
IC50
38000±n/a nM
Citation
 Kawaguchi, MIeda, NNakagawa, H Development of Peptide-Based Sirtuin Defatty-Acylase Inhibitors Identified by the Fluorescence Probe, SFP3, That Can Efficiently Measure Defatty-Acylase Activity of Sirtuin. J Med Chem 62:5434-5452 (2019)  
Target
Name:
NAD-dependent protein deacetylase sirtuin-2
Synonyms:
NAD-Dependent Deacetylase Sirtuin-2 NAD-dependent deacetylase sirtuin 3 SIR2-like SIR2L SIR2_HUMAN Sirtuin 2 (SIRT2)
Type:
Hydrolase
Mol. Mass.:
43172.62
Organism:
Homo sapiens (Human)
Description:
Residue:
389
  
Inhibitor
Name:
BDBM27507
Synonyms:
3-Pyridinecarboxamide NAM nicotinamide | pyridine-3-carboxamide
Type:
Emp. Form.:
C6H6N2O
Mol. Mass.:
122.1246
SMILES:
NC(=O)c1cccnc1
: