Target
Reverse transcriptase
Ligand
BDBM50226664
Substrate
Meas. Tech.
ChEMBL_740498 (CHEMBL1764653)
IC50
171000±n/a nM
Citation
 Bodiwala, HSSabde, SMitra, DBhutani, KKSingh, IP Synthesis of 9-substituted derivatives of berberine as anti-HIV agents. Eur J Med Chem 46:1045-9 (2011)  
Target
Name:
Reverse transcriptase
Synonyms:
Type:
Protein
Mol. Mass.:
29598.37
Organism:
Human immunodeficiency virus 1
Description:
Q9WKE8
Residue:
254
  
Inhibitor
Name:
BDBM50226664
Synonyms:
2-hydroxy-3,9,10-trimethoxy-5,6-dihydroisoquino[3,2-a]isoquinolinium columbamine
Type:
Small organic molecule
Emp. Form.:
C20H20NO4
Mol. Mass.:
338.3766
SMILES:
COc1cc2CC[n+]3cc4c(OC)c(OC)ccc4cc3-c2cc1O
: