Target
ATP-binding cassette sub-family C member 2
Ligand
BDBM50485568
Substrate
Meas. Tech.
ChEMBL_839174 (CHEMBL2077845)
Ki
18300±n/a nM
Citation
 Chu, XYKato, YNiinuma, KSudo, KIHakusui, HSugiyama, Y Multispecific organic anion transporter is responsible for the biliary excretion of the camptothecin derivative irinotecan and its metabolites in rats. J Pharmacol Exp Ther 281:304-14 (1997) Target
Name:
ATP-binding cassette sub-family C member 2
Synonyms:
ATP-binding cassette sub-family C member 2 Canalicular multidrug resistance protein Cmoat MRP2_RAT Multidrug resistance-associated protein 2
Type:
PROTEIN
Mol. Mass.:
173415.22
Organism:
Rattus norvegicus
Description:
ChEMBL_1455464
Residue:
1541
  
Inhibitor
Name:
BDBM50485568
Synonyms:
CHEMBL2074578
Type:
Small organic molecule
Emp. Form.:
C22H22N2O6
Mol. Mass.:
410.4199
SMILES:
CCc1c2Cn3c(cc(c(CO)c3=O)[C@@](O)(CC)C(O)=O)-c2nc2ccc(O)cc12
: