Target
ATP-binding cassette sub-family C member 2
Ligand
BDBM50485570
Substrate
Meas. Tech.
ChEMBL_836172 (CHEMBL2075071)
Ki
162000±n/a nM
Citation
 Han, YHKato, YWatanabe, YTerao, KAsoh, YSugiyama, Y Carrier-mediated hepatobiliary transport of a novel antifolate, N-[4-[(2,4-dianninopteridine-6-yl)methyl]-3,4-dihydro-2H-1,4-benzothiazin-7-yl]carbonyl-L-homoglutamic acid, in rats. Drug Metab Dispos 29:394-400 (2001) Target
Name:
ATP-binding cassette sub-family C member 2
Synonyms:
ATP-binding cassette sub-family C member 2 Canalicular multidrug resistance protein Cmoat MRP2_RAT Multidrug resistance-associated protein 2
Type:
PROTEIN
Mol. Mass.:
173415.22
Organism:
Rattus norvegicus
Description:
ChEMBL_1455464
Residue:
1541
  
Inhibitor
Name:
BDBM50485570
Synonyms:
CHEMBL273608
Type:
Small organic molecule
Emp. Form.:
C22H24N8O5S
Mol. Mass.:
512.542
SMILES:
Nc1nc(N)c2nc(CN3CCSc4cc(ccc34)C(=O)NC(CCCC(O)=O)C(O)=O)cnc2n1
: