Target
ATP-binding cassette sub-family C member 2
Ligand
BDBM50485573
Substrate
Meas. Tech.
ChEMBL_838268 (CHEMBL2076216)
Ki
56900±n/a nM
Citation
 Han, YHKato, YHaramura, MOhta, MMatsuoka, HSugiyama, Y Physicochemical parameters responsible for the affinity of methotrexate analogs for rat canalicular multispecific organic anion transporter (cMOAT/MRP2). Pharm Res 18:579-86 (2001)  
Target
Name:
ATP-binding cassette sub-family C member 2
Synonyms:
ATP-binding cassette sub-family C member 2 Canalicular multidrug resistance protein Cmoat MRP2_RAT Multidrug resistance-associated protein 2
Type:
PROTEIN
Mol. Mass.:
173415.22
Organism:
Rattus norvegicus
Description:
ChEMBL_1455464
Residue:
1541
  
Inhibitor
Name:
BDBM50485573
Synonyms:
CHEMBL2074700
Type:
Small organic molecule
Emp. Form.:
C21H26N8O3
Mol. Mass.:
438.4829
SMILES:
CCC(C)C(NC(=O)c1ccc(cc1)N(C)Cc1cnc2nc(N)nc(N)c2n1)C(O)=O
: