Target
ATP-binding cassette sub-family C member 2
Ligand
BDBM50485577
Substrate
Meas. Tech.
ChEMBL_838268 (CHEMBL2076216)
Ki
137000±n/a nM
Citation
 Han, YHKato, YHaramura, MOhta, MMatsuoka, HSugiyama, Y Physicochemical parameters responsible for the affinity of methotrexate analogs for rat canalicular multispecific organic anion transporter (cMOAT/MRP2). Pharm Res 18:579-86 (2001)  
Target
Name:
ATP-binding cassette sub-family C member 2
Synonyms:
ATP-binding cassette sub-family C member 2 Canalicular multidrug resistance protein Cmoat MRP2_RAT Multidrug resistance-associated protein 2
Type:
PROTEIN
Mol. Mass.:
173415.22
Organism:
Rattus norvegicus
Description:
ChEMBL_1455464
Residue:
1541
  
Inhibitor
Name:
BDBM50485577
Synonyms:
CHEMBL13170
Type:
Small organic molecule
Emp. Form.:
C21H22N8O5S
Mol. Mass.:
498.515
SMILES:
Nc1nc(N)c2nc(CN3CCSc4cc(ccc34)C(=O)NC(CCC(O)=O)C(O)=O)cnc2n1
: