Target
ATP-binding cassette sub-family C member 2
Ligand
BDBM50485583
Substrate
Meas. Tech.
ChEMBL_838268 (CHEMBL2076216)
Ki
136000±n/a nM
Citation
 Han, YHKato, YHaramura, MOhta, MMatsuoka, HSugiyama, Y Physicochemical parameters responsible for the affinity of methotrexate analogs for rat canalicular multispecific organic anion transporter (cMOAT/MRP2). Pharm Res 18:579-86 (2001)  
Target
Name:
ATP-binding cassette sub-family C member 2
Synonyms:
ATP-binding cassette sub-family C member 2 Canalicular multidrug resistance protein Cmoat MRP2_RAT Multidrug resistance-associated protein 2
Type:
PROTEIN
Mol. Mass.:
173415.22
Organism:
Rattus norvegicus
Description:
ChEMBL_1455464
Residue:
1541
  
Inhibitor
Name:
BDBM50485583
Synonyms:
CHEMBL2075022
Type:
Small organic molecule
Emp. Form.:
C22H24N8O5
Mol. Mass.:
480.4766
SMILES:
Nc1nc(N)c2nc(CN(CC=C)c3ccc(cc3)C(=O)NC(CCC(O)=O)C(O)=O)cnc2n1
: