Target
ATP-binding cassette sub-family C member 2
Ligand
BDBM50028370
Substrate
Meas. Tech.
ChEMBL_838268 (CHEMBL2076216)
Ki
173000±n/a nM
Citation
 Han, YHKato, YHaramura, MOhta, MMatsuoka, HSugiyama, Y Physicochemical parameters responsible for the affinity of methotrexate analogs for rat canalicular multispecific organic anion transporter (cMOAT/MRP2). Pharm Res 18:579-86 (2001)  
Target
Name:
ATP-binding cassette sub-family C member 2
Synonyms:
ATP-binding cassette sub-family C member 2 Canalicular multidrug resistance protein Cmoat MRP2_RAT Multidrug resistance-associated protein 2
Type:
PROTEIN
Mol. Mass.:
173415.22
Organism:
Rattus norvegicus
Description:
ChEMBL_1455464
Residue:
1541
  
Inhibitor
Name:
BDBM50028370
Synonyms:
2-{4-[(2,4-Diamino-pteridin-6-ylmethyl)-isopropyl-amino]-benzoylamino}-pentanedioic acid ( Isoaminopterin) | CHEMBL11133
Type:
Small organic molecule
Emp. Form.:
C22H26N8O5
Mol. Mass.:
482.4924
SMILES:
CC(C)N(Cc1cnc2nc(N)nc(N)c2n1)c1ccc(cc1)C(=O)NC(CCC(O)=O)C(O)=O
: