Target
Multidrug resistance-associated protein 1
Ligand
BDBM50485612
Substrate
Meas. Tech.
ChEMBL_835970 (CHEMBL2077108)
IC50
0.960±n/a nM
Citation
 Li, LPan, QSun, MLu, QHu, X Dibenzocyclooctadiene lignans: a class of novel inhibitors of multidrug resistance-associated protein 1. Life Sci 80:741-8 (2007)  
Target
Name:
Multidrug resistance-associated protein 1
Synonyms:
7.6.2.2 ABCC1 ATP-binding cassette, sub-family C, member 1 isoform 1 LTC4 transporter MRP MRP1_HUMAN
Type:
Mol. Mass.:
171597.72
Organism:
Homo sapiens (Human)
Description:
P33527
Residue:
1531
  
Inhibitor
Name:
BDBM50485612
Synonyms:
GOMISIN A
Type:
Small organic molecule
Emp. Form.:
C23H28O7
Mol. Mass.:
416.4642
SMILES:
COc1cc2C[C@@](C)(O)[C@@H](C)Cc3cc4OCOc4c(OC)c3-c2c(OC)c1OC
: