Target
Tubulin beta chain
Ligand
BDBM50485690
Substrate
Meas. Tech.
ChEMBL_853430 (CHEMBL2155288)
EC50
680±n/a nM
Citation
 Lis, LGSmart, MALuchniak, AGupta, MLGurvich, VJ Synthesis and Biological Evaluation of a Biotinylated Paclitaxel With an Extra-Long Chain Spacer Arm. ACS Med Chem Lett 3:745-748 (2012)  
Target
Name:
Tubulin beta chain
Synonyms:
Beta-tubulin Tubulin beta chain
Type:
PROTEIN
Mol. Mass.:
49840.26
Organism:
Sus scrofa
Description:
ChEMBL_105107
Residue:
445
  
Inhibitor
Name:
BDBM50485690
Synonyms:
CHEMBL2152244
Type:
Small organic molecule
Emp. Form.:
C72H92N6O19S
Mol. Mass.:
1377.595
SMILES:
[H][C@@]12C[C@H](OC(=O)CCNC(=O)CCCCCNC(=O)CCCCCNC(=O)CCCC[C@@H]3SC[C@]4([H])NC(=O)N[C@]34[H])[C@@]3(C)C(=O)[C@H](OC(C)=O)C4=C(C)[C@H](C[C@@](O)([C@@H](OC(=O)c5ccccc5)[C@]3([H])[C@@]1(CO2)OC(C)=O)C4(C)C)OC(=O)[C@H](O)[C@@H](NC(=O)c1ccccc1)c1ccccc1
: