Target
Dihydrofolate reductase
Ligand
BDBM50029769
Substrate
Meas. Tech.
ChEMBL_52981 (CHEMBL876710)
IC50
1200±n/a nM
Citation
 Queener, SF New drug developments for opportunistic infections in immunosuppressed patients: Pneumocystis carinii. J Med Chem 38:4739-59 (1996)  
Target
Name:
Dihydrofolate reductase
Synonyms:
DYR_PNECA Dihydrofolate reductase Tetrahydrofolate dehydrogenase
Type:
Enzyme
Mol. Mass.:
23891.29
Organism:
Pneumocystis carinii
Description:
Residue:
206
  
Inhibitor
Name:
BDBM50029769
Synonyms:
6-[2-(2,5-Dimethoxy-phenyl)-ethyl]-5-methyl-thieno[2,3-d]pyrimidine-2,4-diamine | CHEMBL322585
Type:
Small organic molecule
Emp. Form.:
C17H20N4O2S
Mol. Mass.:
344.431
SMILES:
COc1ccc(OC)c(CCc2sc3nc(N)nc(N)c3c2C)c1
: