Target
Mu-type opioid receptor
Ligand
BDBM50029783
Substrate
Meas. Tech.
ChEMBL_148838 (CHEMBL753956)
Ki
35.5±n/a nM
Citation
 Bertha, CMVilner, BJMattson, MVBowen, WDBecketts, KXu, HRothman, RBFlippen-Anderson, JLRice, KC (E)-8-benzylidene derivatives of 2-methyl-5-(3-hydroxyphenyl)morphans: highly selective ligands for the sigma 2 receptor subtype. J Med Chem 38:4776-85 (1996)  
Target
Name:
Mu-type opioid receptor
Synonyms:
MOR-1 Mu-type opioid receptor (MOR) OPRM_RAT Opioid receptor B Ror-b
Type:
G Protein-Coupled Receptor (GPCR)
Mol. Mass.:
44503.11
Organism:
Rattus norvegicus (rat)
Description:
Competition binding assays were carried out using membrane preparations from transfected HN9.10 cells that constitutively expressed the mu opioid receptor.
Residue:
398
  
Inhibitor
Name:
BDBM50029783
Synonyms:
5-(3-Hydroxy-phenyl)-2-methyl-2-aza-bicyclo[3.3.1]nonan-7-one | CHEMBL38791
Type:
Small organic molecule
Emp. Form.:
C15H19NO2
Mol. Mass.:
245.3169
SMILES:
CN1CCC2(CC1CC(=O)C2)c1cccc(O)c1
: